{"text_format":"1","workbook":"xlsx","n_sheets":7,"sheets":["Emploi","Effectifs","Référentiel","Liste grade","Disponibilité","Détachement","Congé parental"],"not_rendered":{"charts":0,"images":0,"macros":1,"external_links":0,"defined_names":13,"comments":0,"pivot_tables":0},"unopened":[],"bounds":{"document_bytes":16777216,"sheet_cells":100000,"rows_first":2000,"rows_last":500,"rows_between":2000,"halvings":0,"cell_chars":16384,"cell_head_chars":4096},"cells_cut":0,"cells_raw":0,"read":"whole","date_system":"1900"}

{"sheet":"Emploi","index":0,"n_rows":10,"n_cols":22,"rows_kept":10,"cut":false,"hidden":false,"merged":[[7,3,8,3],[1,1,3,18],[1,19,3,20],[0,0,0,2],[0,3,0,4],[7,17,8,17],[7,13,8,13],[7,5,8,5],[7,15,8,15],[7,16,8,16],[7,18,8,18],[7,0,8,0],[7,20,8,20],[7,14,8,14],[7,1,8,1],[7,2,8,2],[7,21,8,21],[7,4,8,4],[7,12,8,12],[7,19,8,19],[7,8,7,10],[7,6,7,7],[7,11,8,11]]}
["Date de dernière mise à jour :"]
[null,"TABLEAU DE SUIVI DES EMPLOIS"]
[]
[]
[]
[]
[]
["Numéro de l'emploi","Libellé de l'emploi","Date de création ou modifcation","Référence délibération  ","Nature de l'emploi ","Numéro de DVE","Temps de travail hebdomadaire de l'emploi créé en heures",null,"Catégorie(s)\nhiérarchique(s)",null,null,"Filière(s)","Grade(s) \nouvert (s)","Grade \nretenu","Emploi pouvant être pouvu \npar un contractuel\n(Art. L332-23 disposition 1 du code général de la fonction publique) ","Niveau de qualification requis","Indice de remunération","Groupe RIFSEEP","Emploi télétravaillable","Emploi pourvu","Agent affecté sur l'emploi\n(Formule automatique)","Alerte DVE\n(Formule automatique)"]
[null,null,null,null,null,null,"TC","TNC","A","B","C"]
["EMPLOI1","Secrétaire de mairie","1995-12-23","DELIB001","Création",2151651545445,"-",5,null,"X",null,null,"ADMINISTRATIVE","Rédacteur","Oui","Niveau 4 : Baccalauréat",null,2,"Oui","Oui",{"$f":"IF(A10=\"\",\"\",IF(ISNA(VLOOKUP(A10,Effectifs!A:Q,3,FALSE))=TRUE,\"Aucun agent renseigné dans le tableau des effectifs\",VLOOKUP(A10,Effectifs!A:Q,2,FALSE)&\" \"&VLOOKUP(A10,Effectifs!A:Q,3,FALSE)&\" \"&VLOOKUP(A10,Effectifs!A:Q,4,FALSE)))","v":"Madame aa bb"},{"$f":"IF(OR(U10=\"Aucun agent renseigné dans le tableau des effectifs\",U10=\"\",U10=\"  \"),\"\",IF(OR(VLOOKUP(A10,Effectifs!A:Q,7,FALSE)=\"Fonctionnaire\",VLOOKUP(A10,Effectifs!A:Q,7,FALSE)=\"Fonctionnaire Stagiaire\",VLOOKUP(A10,Effectifs!A:Q,7,FALSE)=\"\"),\"\",IF(TODAY()>VLOOKUP(A10,Effectifs!A:Q,13,FALSE)-60,\"Vacance d'emploi dans moins de 2 mois\",\"\")))","v":""}]

{"sheet":"Effectifs","index":1,"n_rows":9,"n_cols":17,"rows_kept":9,"cut":false,"hidden":false,"merged":[[0,0,0,2],[0,3,0,4],[1,0,1,16],[6,12,7,12],[6,14,7,14],[6,15,7,15],[6,16,7,16],[6,0,7,0],[6,7,7,7],[6,8,7,8],[6,9,7,9],[6,10,7,10],[6,11,7,11],[6,3,7,3],[6,2,7,2],[6,1,7,1],[6,6,7,6],[6,5,7,5],[6,4,7,4]]}
["Date de dernière mise à jour :"]
["TABLEAU DE SUIVI DES EFFECTIFS"]
[]
[]
[]
[]
["Numéro de l'emploi d'affectation","Genre","Nom","Prénom","Date de naissance","BOETH","Statut","Catégorie\nhiérarchique","Grade\n","Date d'entrée sur le poste","Type de contrat","Date de début","Date de fin","Si temps partiel","Position actuelle","Date de début de la position (si applicable)","Date de fin de la position (si applicable)"]
[null,null,null,null,null,null,null,null,null,null,null,null,null,"Quotité"]
["EMPLOI1","Madame","aa","bb",null,null,"Contractuel permanent","Cat_B","Rédacteur",null,"Article L.332-14","15/01/201","2024-06-15"]

{"sheet":"Référentiel","index":2,"n_rows":46,"n_cols":4,"rows_kept":46,"cut":false,"hidden":true,"merged":[]}
["Nature de l'emploi (ex: emploi permanent, contrat de projet - apprenti - liste RSU)"]
["Agent sur emploi permanent"]
["Accroissement temporaire d'activité ou saisonnier"]
["Accueillants familiaux"]
["Apprentis"]
["Assistants familiaux"]
["Assistants maternels"]
["Autres"]
["Collaborateurs de cabinet"]
["Contractuels en contrat de projet "]
["Emploi aidé"]
["Personnes bénéficiant d'une rémunération accessoire autorisée"]
["Vacataires"]
[]
[]
[]
[]
[null,"CAP, BEP","Niveau 3 (anciennement V)",{"$f":"LEFT(C18,8)&\" : \"&B18","v":"Niveau 3 : CAP, BEP"}]
["Bac","Baccalauréat","Niveau 4 (anciennement IV)",{"$f":"LEFT(C19,8)&\" : \"&B19","v":"Niveau 4 : Baccalauréat"}]
["Bac + 2","DEUG, BTS, DUT, DEUST","Niveau 5 (anciennement III)","Niveau 5 : DEUG, BTS, DUT, DEUST"]
["Bac + 3","Licence, Licence LMD, licence professionnelle","Niveau 6 (anciennement II)","Niveau 6 : Licence, Licence LMD, licence professionnelle"]
["Bac + 4","Maîtrise","Niveau 6 (anciennement II)","Niveau 6 : Maîtrise"]
["Bac + 5","Master, DEA, DESS, diplôme d'ingénieur","Niveau 7 (anciennement I)","Niveau 7 : Master, DEA, DESS, diplôme d'ingénieur"]
["Bac + 8","Doctorat, habilitation à diriger des recherches","Niveau 8 (anciennement I)","Niveau 8 : Doctorat, habilitation à diriger des recherches"]
[]
[]
[]
[]
["Article L.332-13"]
["Article L.332-14"]
["Article L.332-23"]
["Article L.332-24"]
["Article L.332-25"]
["Article L.332-26"]
["Article L.332-8"]
["CDI"]
[]
[]
[]
["En activité"]
["Détachement"]
["En congé parental (article 75)"]
["En congé spécial (article 99)"]
["En disponibilité (article 72)"]
["En disponibilité d'office ou bénéficiaires d'un congé équivalent"]
["Mis à disposition dans une autre structure (articles 61 et 136)"]

{"sheet":"Liste grade","index":3,"n_rows":229,"n_cols":5,"rows_kept":229,"cut":false,"hidden":true,"merged":[]}
["Adjoint administratif",null,"Cat_A","Cat_B","Cat_C"]
["Adjoint administratif principal de 1ère classe",null,"Adjudant","Animateur ","Adjoint administratif"]
["Adjoint administratif principal de 2ème classe",null,"Administrateur ","Animateur principal de 1ère classe","Adjoint administratif principal de 1ère classe"]
["Adjoint administratif principal de 2ème classe stagiaire",null,"Administrateur général","Animateur principal de 2ème classe","Adjoint administratif principal de 2ème classe"]
["Adjoint administratif stagiaire",null,"Administrateur hors classe","Animateur principal de 2ème classe stagiaire","Adjoint administratif principal de 2ème classe stagiaire"]
["Adjoint technique",null,"Administrateur stagiaire","Animateur stagiaire","Adjoint administratif stagiaire"]
["Adjoint technique des établissements d'enseignement",null,"Assistant socio-éducatif  ","Assistant de conservation ","Adjoint technique"]
["Adjoint technique des établissements d'enseignement principal de 1ère classe",null,"Assistant socio-éducatif de 2ème classe stagiaire","Assistant de conservation principal de 1ère classe ","Adjoint technique des établissements d'enseignement"]
["Adjoint technique des établissements d'enseignement principal de 2ème classe",null,"Assistant socio-éducatif de classe exceptionnelle","Assistant de conservation principal de 2ème classe ","Adjoint technique des établissements d'enseignement stagiaire"]
["Adjoint technique des établissements d'enseignement principal de 2ème classe stagiaire",null,"Attaché","Assistant de conservation principal de 2ème classe stagiaire","Adjoint technique principal de 1ère classe"]
["Adjoint technique des établissements d'enseignement stagiaire",null,"Attaché de conservation du patrimoine ","Assistant de conservation stagiaire","Adjoint technique principal de 2ème classe"]
["Adjoint technique principal de 1ère classe",null,"Attaché de conservation du patrimoine stagiaire","Assistant d'enseignement artistique","Adjoint technique principal de 2ème classe stagiaire"]
["Adjoint technique principal de 2ème classe",null,"Attaché hors classe","Assistant d'enseignement artistique principal de 1ère classe","Adjoint technique principal des établissements d'enseignement de 1ère classe"]
["Adjoint technique principal de 2ème classe stagiaire",null,"Attaché principal ","Assistant d'enseignement artistique principal de 2ème classe ","Adjoint technique principal des établissements d'enseignement de 2ème classe"]
["Adjoint technique stagiaire",null,"Attaché principal de conservation du patrimoine ","Assistant d'enseignement artistique principal de 2ème classe stagiaire","Adjoint technique principal des établissements d'enseignement de 2ème classe stagiaire"]
["Adjoint territorial d'animation",null,"Attaché stagiaire","Assistant d'enseignement artistique stagiaire","Adjoint technique stagiaire"]
["Adjoint territorial d'animation principal de 1ère classe",null,"Bibliothécaire ","Cadre de santé de 1ère classe","Adjoint territorial d'animation"]
["Adjoint territorial d'animation principal de 2ème classe",null,"Bibliothécaire principal","Chef de service de police municipale ","Adjoint territorial d'animation principal de 1ère classe"]
["Adjoint territorial d'animation principal de 2ème classe stagiaire",null,"Bibliothécaire stagiaire","Chef de service de police municipale principal de 1ère classe","Adjoint territorial d'animation principal de 2ème classe"]
["Adjoint territorial d'animation stagiaire",null,"Biologiste, vétérinaire et pharmacien de classe exceptionnelle","Chef de service de police municipale principal de 2ème classe","Adjoint territorial d'animation principal de 2ème classe stagiaire"]
["Adjoint territorial du patrimoine",null,"Biologiste, vétérinaire et pharmacien de classe normale ","Chef de service de police municipale stagiaire","Adjoint territorial d'animation stagiaire"]
["Adjoint territorial du patrimoine principal de 1ère classe",null,"Biologiste, vétérinaire et pharmacien de classe normale stagiaire","Directeur de police municipale","Adjoint territorial du patrimoine"]
["Adjoint territorial du patrimoine principal de 2ème classe",null,"Biologiste, vétérinaire et pharmacien hors classe","Directeur de police municipale stagiaire","Adjoint territorial du patrimoine principal de 1ère classe"]
["Adjoint territorial du patrimoine principal de 2ème classe stagiaire",null,"Cadre de santé","Directeur principal de police municipale","Adjoint territorial du patrimoine principal de 2ème classe"]
["Adjoint territorial du patrimoine stagiaire",null,"Cadré de santé de 1ère classe","Educateur","Adjoint territorial du patrimoine principal de 2ème classe stagiaire"]
["Adjudant",null,"Cadre de santé de 2ème classe","Educateur principal de 1ère classe","Adjoint territorial du patrimoine stagiaire"]
[null,null,"Cadre de santé de 2ème classe stagiaire","Educateur principal de 2ème classe","Agent de maîtrise"]
["Administrateur général",null,"Cadre supérieur de santé","Educateur principal stagiaire de 2ème classe","Agent de maîtrise principal"]
["Administrateur hors classe",null,"Cadres de santé paramédicaux","Educateur stagiaire","Agent de maîtrise stagiaire"]
["Administrateur stagiaire",null,"Capitaine","Infirmier de classe normale","Agent social "]
["Agent de maîtrise",null,"Capitaine stagiaire","Infirmier de classe supérieure","Agent social principal de 1ère classe"]
["Agent de maîtrise principal",null,"Colonel","Lieutenant de 1ère classe","Agent social principal de 2ème classe"]
["Agent de maîtrise stagiaire",null,"Colonel hors classe","Lieutenant de 1ère classe stagiaire","Agent social principal de 2ème classe stagiaire"]
["Agent social ",null,"Colonel stagiaire","Lieutenant de 2ème classe ","Agent social stagiaire"]
["Agent social principal de 1ère classe",null,"Commandant","Lieutenant de 2ème classe stagiaire","Agent spécialisé principal de 1ère classe des écoles maternelles"]
["Agent social principal de 2ème classe",null,"Conseiller ","Lieutenant hors classe","Agent spécialisé principal de 2ème classe des écoles maternelles"]
["Agent social principal de 2ème classe stagiaire",null,"Conseiller hors classe socio-éducatif","Moniteur-éducateur et intervenant familial ","Agent spécialisé principal de 2ème classe des écoles maternelles stagiaire"]
["Agent social stagiaire",null,"Conseiller principal","Moniteur-éducateur et intervenant familial principal","Auxiliaire de puériculture principal de 1ère classe"]
["Agent spécialisé principal de 1ère classe des écoles maternelles",null,"Conseiller socio-éducatif","Moniteur-éducateur et intervenant familial stagiaire","Auxiliaire de puériculture principal de 2ème classe"]
["Agent spécialisé principal de 2ème classe des écoles maternelles",null,"Conseiller socio-éducatif stagiaire","Rédacteur","Auxiliaire de puériculture principal de 2ème classe stagiaire"]
["Agent spécialisé principal de 2ème classe des écoles maternelles stagiaire",null,"Conseiller stagiaire","Rédacteur principal de 1ère classe","Auxiliaire de soins principal de 1ère classe"]
["Animateur",null,"Conseiller supérieur socio-éducatif","Rédacteur principal de 2ème classe","Auxiliaire de soins principal de 2ème classe"]
["Animateur principal de 1ère classe",null,"Conservateur ","Rédacteur principal de 2ème classe stagiaire","Auxiliaire de soins principal de 2ème classe stagiaire"]
["Animateur principal de 2ème classe",null,"Conservateur en chef","Rédacteur stagiaire","Brigadier-chef principal"]
["Animateur principal de 2ème classe stagiaire",null,"Conservateur stagiaire","Technicien ","Caporal"]
["Animateur stagiaire",null,"Contrôleur général","Technicien paramédical de classe normale","Caporal stagiaire"]
["Assistant de conservation ",null,"Directeur d'établissement d'enseignement artistique de 1ère catégorie","Technicien paramédical de classe normale stagiaire","Caporal-chef"]
["Assistant de conservation principal de 1ère classe ",null,"Directeur d'établissement d'enseignement artistique de 1ère catégorie stagiaire","Technicien paramédical de classe supérieure","Chef de police municipale"]
["Assistant de conservation principal de 2ème classe ",null,"Directeur d'établissement d'enseignement artistique de 2ème catégorie","Technicien principal de 1ère classe","Garde-champêtre chef "]
["Assistant de conservation principal de 2ème classe stagiaire",null,"Directeur d'établissement d'enseignement artistique de 2ème catégorie stagiaire","Technicien principal de 2ème classe","Garde-champêtre chef principal"]
["Assistant de conservation stagiaire",null,"Directeur territorial","Technicien principal de 2ème classe stagiaire","Garde-champêtre chef stagiaire"]
["Assistant d'enseignement artistique",null,"Educateur de jeunes enfants ","Technicien stagiaire","Gardien-brigadier "]
["Assistant d'enseignement artistique principal de 1ère classe",null,"Educateur de jeunes enfants de 2ème classe stagiaire",null,"Gardien-brigadier stagiaire"]
["Assistant d'enseignement artistique principal de 1ère classe stagiaire",null,"Educateur de jeunes enfants de classe exceptionnelle",null,"Opérateur "]
["Assistant d'enseignement artistique principal de 2ème classe",null,"Infirmier de classe normale stagiaire",null,"Opérateur principal"]
["Assistant d'enseignement artistique principal de 2ème classe stagiaire",null,"infirmier en soins généraux de classe normale",null,"Opérateur qualifié"]
["Assistant d'enseignement artistique stagiaire",null,"Infirmier en soins généraux de classe normale stagiaire",null,"Opérateur qualifié stagiaire"]
["Assistant socio-éducatif",null,"Infirmier en soins généraux de classe supérieure",null,"Sapeur"]
["Assistant socio-éducatif de 2nde classe",null,"Infirmier en soins généraux hors classe",null,"Sapeur stagiaire"]
["Assistant socio-éducatif de classe exceptionnelle ",null,"Infirmier hors classe"]
{"$rows_left_out":170}
{"sheet":"Disponibilité","index":4,"n_rows":67,"n_cols":4,"rows_kept":67,"cut":false,"hidden":true,"merged":[[12,1,14,1],[12,2,14,2],[5,1,8,1],[5,2,8,2],[5,3,8,3],[9,1,11,1],[9,2,11,2],[29,0,30,0],[29,1,30,1],[29,2,30,2],[15,1,16,1],[15,2,16,2],[22,1,24,1],[22,2,24,2],[25,0,26,0],[25,1,26,1],[25,2,26,2],[36,3,39,3],[25,3,26,3],[27,1,28,1],[27,2,28,2],[27,3,28,3],[32,0,33,0],[32,1,33,1],[32,2,33,2],[36,1,39,1],[36,2,39,2],[64,0,66,0],[64,1,66,1],[64,2,66,2],[40,1,48,1],[40,2,48,2],[50,0,54,0],[50,1,54,1],[50,2,54,2],[55,0,63,0],[55,1,63,1],[55,2,63,2]]}
["Disponibilité –vacance de poste"]
[]
[]
["DISPONIBILITES DE DROIT"]
["Disponibilité pour convenances personnelles"]
["Disponibilité pour raisons familiales"," D’une durée de 6 mois maximum","L’emploi n’est pas vacant","Réintégration du fonctionnaire sur l’emploi qu’il occupait"]
["-          Pour élever un enfant de moins de 12 ans"]
["-          Pour des soins à un enfant, à un conjoint, partenaire de pacs ou ascendant"]
["-          Pour suivre son conjoint ou partenaire de pacs"]
["-          Pour élever un enfant de moins de 12 ans","Plus de 6 mois","L’emploi est vacant","-En cas d’emploi vacant : réaffectation à la première vacance ou création d’emploi dans un emploi relevant de son grade. Si refus de l’emploi proposé par l’agent : maintien en disponibilité d’office"]
["-          Pour des soins à un enfant, à un conjoint, partenaire de pacs ou ascendant",null,null,"- En cas d’absence d’emploi vacant : maintien en surnombre- tout emploi créé ou vacant correspondant à son grade lui est proposé en priorité. Après un an de surnombre, prise en charge par CDG"]
["-           "]
["Disponibilité pour raisons familiales","Inférieure ou égale à 3 ans","L’emploi est vacant","-En cas d’emploi vacant : réaffectation à la première vacance ou création d’emploi dans un emploi relevant de son grade. Si refus de l’emploi proposé par l’agent : maintien en disponibilité d’office"]
["-          Pour suivre son conjoint ou partenaire de pacs",null,null,"- En cas d’absence d’emploi vacant : maintien en surnombre- tout emploi créé ou vacant correspondant à son grade lui est proposé en priorité. Après un an de surnombre, prise en charge par CDG"]
[]
["Disponibilité pour raisons familiales","Supérieure à 3 ans","L’emploi est vacant","Une des trois premières vacances d’emploi dans la collectivité doit lui être proposée. Elle est de droit sur la troisième."]
["-          Pour suivre son conjoint ou partenaire de pacs",null,null,"Dans l’attente, l’agent est maintenu en disponibilité."]
["Disponibilité pour adoption hors métropole",null,"L’emploi n’est pas vacant","Réaffectation dans son emploi antérieur"]
["Disponibilité pour exercer un mandat électif (mandats ouverts au détachement – application du code du travail)",null,"L’emploi n’est pas vacant","Au terme de son mandat électif, il retrouve son emploi ou un emploi analogue dans les deux mois suivant sa demande de réintégration"]
["Disponibilité pour exercer un mandat électif (autres mandats que ceux prévus par le code du travail)","Egale ou moins de 3 ans","L’emploi est vacant","Réintégration sur l’une des trois premières vacances d’emploi -"]
["Disponibilité pour exercer un mandat électif (autres mandats que ceux prévus par le code du travail)","Supérieure à 3 ans","L’emploi est vacant","Réintégration dans un délai raisonnable. Maintien en disponibilité dans l’attente"]
["DISPONIBILITES DISCRETIONNAIRES"]
["Disponibilité pour convenances personnelles","Egale ou moins de 3 ans","L’emploi est vacant","Une des trois premières vacances d’emploi dans la collectivité doit lui être proposée. Elle est de droit sur la troisième."]
["Durée maximale de 5 ans renouvelable dans la limite d'un total de 10 années sur l'ensemble de la carrière. Le renouvellement est accordé à condition que le fonctionnaire, au plus tard au terme d’une période de 5 ans de disponibilité, ait accompli, après avoir été réintégré, au moins 18 mois de services effectifs continus dans la fonction publique",null,null,"."]
[]
["Disponibilité pour convenances personnelles","Supérieure à 3 ans","L’emploi est vacant","Réintégration dans un délai raisonnable. Maintien en disponibilité dans l’attente"]
[]
["Disponibilité pour convenances personnelles"," Quelle que soit la durée","L’emploi n’est pas vacant","Réintégration sur le poste"]
["Pour exercice mandat électif"]
["Disponibilité pour études ou recherches présentant un intérêt général, pour une durée maximale de 3 années, renouvelable une fois pour une durée égale","Egale ou moins de 3 ans","L’emploi est vacant","Une des trois premières vacances d’emploi dans la collectivité doit lui être proposée. Elle est de droit sur la troisième."]
[null,null,null,"."]
["Disponibilité pour études ou recherches","Supérieure à 3 ans","L’emploi est vacant","Réintégration dans un délai raisonnable. Maintien en disponibilité dans l’attente"]
["Disponibilité pour créer ou reprendre une entreprise au sens de l'article L. 5141-1 du code du travail, pour une durée maximale de deux années","Egale ou moins de 3 ans","L’emploi est vacant","Une des trois premières vacances d’emploi dans la collectivité doit lui être proposée. Elle est de droit sur la troisième."]
[null,null,null,"."]
["Disponibilité pour créer ou reprendre une entreprise","Supérieure à 3 ans","L’emploi est vacant","Réintégration dans un délai raisonnable. Maintien en disponibilité dans l’attente"]
["DISPONIBILITE d’OFFICE POUR RAISONS DE SANTE"]
["Disponibilité d’office pour raisons de santé :","Inférieure ou égale à 6 mois","L’emploi n’est pas vacant"]
["-          A l’expiration des droits statutaires à congé de maladie (sans pouvoir bénéficier d’un reclassement ou d’une PPR)"]
["-          Lors de la Réintégration anticipée d’une disponibilité discrétionnaire + inaptitude physique"]
["-          Dans l’attente d’une décision de reclassement, de reprise, de mise en dispo, de mise à la retraite, à expiration des droits statutaires à congé de maladie"]
["Disponibilité d’office pour raisons de santé :","Supérieure à 6 mois"," L’emploi est vacant","Le fonctionnaire est réintégré dans son corps ou cadre d'emplois et réaffecté, dans sa collectivité ou dans son établissement, à la première vacance ou création d'emploi correspondant à son grade. S'il refuse l'emploi proposé, il est placé en position de disponibilité d'office et il ne peut être nommé que lorsqu'une vacance est ouverte ou un poste créé. "]
["-          A l’expiration des droits statutaires à congé de maladie (sans pouvoir bénéficier d’un reclassement ou d’une PPR)"]
["-          Lors de la Réintégration anticipée d’une disponibilité discrétionnaire + inaptitude physique",null,null,"Lorsqu’aucun emploi n'est vacant à l’issue de la disponibilité, le fonctionnaire est maintenu en surnombre pendant un an dans sa collectivité."]
["-          Dans l’attente d’une décision de reclassement, de reprise, de mise en dispo, de mise à la retraite, à expiration des droits statutaires à congé de maladie"]
[]
[]
[]
[]
[]
["DISPONIBILITE DANS L’ATTENTE D’UNE REINTEGRATION"]
["-          Lors de l’interruption du détachement par le fonctionnaire",null,null,"Jusqu’au terme normal du détachement, l’agent est maintenu en disponibilité s’il ne peut être réintégré sur un emploi vacant."]
[]
[null,null,null,"Puis application des règles au terme d’un détachement de plus de 6 mois : réaffectation à la première vacance d’emploi. Et placement en surnombre pendant 1 an"]
[]
[]
[" -refus d’un emploi proposé  à la réintégration au terme ou en cours de détachement",null,null,"Maintien en dispo pour une durée maximale de 3 ans"]
[]
[null,null,null,"Réintégration possible qu’en cas de vacance ou création de poste"]
[]
[null,null,null,"Si refus de 3 postes pendant cette période : soit admis à la retraite, si droits à pension ou licencié"]
{"$rows_left_out":8}
{"sheet":"Détachement","index":5,"n_rows":3,"n_cols":1,"rows_kept":3,"cut":false,"hidden":true,"merged":[]}
["Poste vacant pour :"]
["- Détachement et disponibilité de + de 6 mois ;"]
["- Détachement pour stage : poste non vacant, il devient vacant après titularisation de l'agent ; "]

{"sheet":"Congé parental","index":6,"n_rows":1,"n_cols":1,"rows_kept":1,"cut":false,"hidden":true,"merged":[]}
["- Congé parental : à priori le poste peut-être vacant dès le 1er jour mais nous préconisons également 6 mois. Le mieux c'est tout de même de garder le poste vacant pour pas que l'agent se retrouve en surnombre."]